Target
Non-receptor tyrosine-protein kinase TYK2
Ligand
BDBM153670
Substrate
Meas. Tech.
Inhibition Assay
pH
7.2±n/a
Ki
9.1±n/a nM
Comments
extracted
Citation
 Gibbons, PHanan, ELiu, WLyssikatos, JPMagnuson, SRMendonca, RPastor, RRawson, TESiu, MZak, MZhou, AZhu, B Pyrazolopyrimidine JAK inhibitor compounds and methods US Patent  US8999998 Publication Date 4/7/2015 
Target
Name:
Non-receptor tyrosine-protein kinase TYK2
Synonyms:
Non-receptor tyrosine-protein kinase TYK2 (TYK2) TYK2_HUMAN | Tyrosine-protein kinase TYK2
Type:
Protein
Mol. Mass.:
133666.03
Organism:
Homo sapiens (Human)
Description:
P29597
Residue:
1187
  
Inhibitor
Name:
BDBM153670
Synonyms:
US8999998, 283
Type:
Small organic molecule
Emp. Form.:
C24H24ClN7O3
Mol. Mass.:
493.945
SMILES:
COc1ccc(Cl)cc1-c1nn(CC(=O)N2CCCC2C)cc1NC(=O)c1cnn2cccnc12
: