Target
Aldehyde dehydrogenase, mitochondrial
Ligand
BDBM153691
Substrate
Meas. Tech.
Inhibition Assay
pH
7.4±n/a
IC50
480±n/a nM
Comments
extracted
Citation
 Cannizzaro, CEGraupe, MGuerrero, JALu, YStrickley, RGVenkataramani, CZablocki, J Compounds for the treatment of addiction US Patent  US9000015 Publication Date 4/7/2015 
Target
Name:
Aldehyde dehydrogenase, mitochondrial
Synonyms:
ALDH class 2 ALDH2 ALDHI Aldehyde dehydrogenase (ALDH2)
Type:
Enzyme
Mol. Mass.:
56382.67
Organism:
Homo sapiens (Human)
Description:
P05091
Residue:
517
  
Inhibitor
Name:
BDBM153691
Synonyms:
US10507215, Compound 8 US9610299, Example 8
Type:
Small organic molecule
Emp. Form.:
C20H16Cl2N2O2
Mol. Mass.:
387.259
SMILES:
Cc1cc(CNC(=O)c2c(Cl)cccc2Cl)ccc1-c1cc[nH]c(=O)c1
: