Target
Serine/threonine-protein kinase TBK1
Ligand
BDBM153732
Substrate
Meas. Tech.
KinEASE-STK Assay
IC50
<1±n/a nM
Citation
 Richters, ABasu, DEngel, JErcanoglu, MSBalke-Want, HTesch, RThomas, RKRauh, D Identification and further development of potent TBK1 inhibitors. ACS Chem Biol 10:289-98 (2015)  
Target
Name:
Serine/threonine-protein kinase TBK1
Synonyms:
NAK Protein cereblon/Serine/threonine-protein kinase TBK1 TANK-binding kinase 1 (TBK-1) TBK1 | TBK1_HUMAN
Type:
protein
Mol. Mass.:
83645.20
Organism:
Homo sapiens (Human)
Description:
Q9UHD2
Residue:
729
  
Inhibitor
Name:
BDBM153732
Synonyms:
K252a
Type:
Small organic molecule
Emp. Form.:
C27H21N3O5
Mol. Mass.:
467.4727
SMILES:
[H]C12C[C@@](O)(C(=O)OC)[C@](C)(O1)n1c3ccccc3c3c4CNC(=O)c4c4c5ccccc5n2c4c13
: