Target
Serine/threonine-protein kinase TBK1
Ligand
BDBM25012
Substrate
Meas. Tech.
KinEASE-STK Assay
IC50
802± 26 nM
Citation
 Richters, ABasu, DEngel, JErcanoglu, MSBalke-Want, HTesch, RThomas, RKRauh, D Identification and further development of potent TBK1 inhibitors. ACS Chem Biol 10:289-98 (2015)  
Target
Name:
Serine/threonine-protein kinase TBK1
Synonyms:
NAK Protein cereblon/Serine/threonine-protein kinase TBK1 TANK-binding kinase 1 (TBK-1) TBK1 | TBK1_HUMAN
Type:
protein
Mol. Mass.:
83645.20
Organism:
Homo sapiens (Human)
Description:
Q9UHD2
Residue:
729
  
Inhibitor
Name:
BDBM25012
Synonyms:
4-[2-(4-amino-1,2,5-oxadiazol-3-yl)-1-ethyl-7-(piperidin-4-yloxy)-1H-imidazo[4,5-c]pyridin-4-yl]-2-methylbut-3-yn-2-ol oxadiazole-containing compound, 3f
Type:
Small organic molecule
Emp. Form.:
C20H25N7O3
Mol. Mass.:
411.4576
SMILES:
CCn1c(nc2c(ncc(OC3CCNCC3)c12)C#CC(C)(C)O)-c1nonc1N
: