Target
Protein kinase C beta type
Ligand
BDBM153757
Substrate
Meas. Tech.
Inhibition Assay
pH
7.4±n/a
Temperature
303.15±n/a K
Ki
3.05±n/a nM
Comments
extracted
Citation
 Botrous, IHong, YLi, HLiu, KKNukui, STeng, MTompkins, EVYin, C 3-amido-pyrrolo[3,4-C]pyrazole-5(1H, 4H,6H) carbaldehyde derivatives US Patent  US8999981 Publication Date 4/7/2015 
Target
Name:
Protein kinase C beta type
Synonyms:
KPCB_HUMAN PKC beta PKCB PRKCB1 Protein kinase C beta type | Protein kinase C beta type II (PRKCB2)
Type:
Enzyme
Mol. Mass.:
76873.67
Organism:
Homo sapiens (Human)
Description:
The recombinant human PKC enzymes were produced using a baculovirus expression system in SF9 cells
Residue:
671
  
Inhibitor
Name:
BDBM153757
Synonyms:
US8999981, A2
Type:
Small organic molecule
Emp. Form.:
C24H33N7O2
Mol. Mass.:
451.5645
SMILES:
C[C@H]1CN(C)C2(CCCC2)CN1C(=O)N1Cc2c(NC(=O)c3ccccn3)n[nH]c2C1(C)C
: