Target
Protein kinase C beta type
Ligand
BDBM153978
Substrate
Meas. Tech.
Inhibition Assay
pH
7.4±n/a
Temperature
303.15±n/a K
Ki
<10±n/a nM
Comments
extracted
Citation
 Botrous, IHong, YLi, HLiu, KKNukui, STeng, MTompkins, EVYin, C 3-amido-pyrrolo[3,4-C]pyrazole-5(1H, 4H,6H) carbaldehyde derivatives US Patent  US8999981 Publication Date 4/7/2015 
Target
Name:
Protein kinase C beta type
Synonyms:
KPCB_HUMAN PKC beta PKCB PRKCB1 Protein kinase C beta type | Protein kinase C beta type II (PRKCB2)
Type:
Enzyme
Mol. Mass.:
76873.67
Organism:
Homo sapiens (Human)
Description:
The recombinant human PKC enzymes were produced using a baculovirus expression system in SF9 cells
Residue:
671
  
Inhibitor
Name:
BDBM153978
Synonyms:
US8999981, F34
Type:
Small organic molecule
Emp. Form.:
C26H42N8O3
Mol. Mass.:
514.6635
SMILES:
C.C[C@H]1CN(CC2CCOCC2)CCN1C(=O)N1Cc2c(NC(=O)c3cc(C)nn3C)n[nH]c2C1(C)C
: