Target
Platelet-activating factor acetylhydrolase IB subunit alpha2
Ligand
BDBM154529
Substrate
Meas. Tech.
Competitive ABPP Assays in Proteomes with FP-alkyne
pH
7.5±n/a
IC50
1.1e+3±n/a nM
Comments
extracted
Citation
 Chang, JWZuhl, AMSpeers, AENiessen, SBrown, SJMulvihill, MMFan, YCSpicer, TPSouthern, MScampavia, LFernandez-Vega, VDix, MMCameron, MDHodder, PSRosen, HNomura, DKKwon, OHsu, KLCravatt, BF Selective inhibitor of platelet-activating factor acetylhydrolases 1b2 and 1b3 that impairs cancer cell survival. ACS Chem Biol 10:925-32 (2015)  
Target
Name:
Platelet-activating factor acetylhydrolase IB subunit alpha2
Synonyms:
PA1B2_MOUSE Pafahb | Platelet-activating factor acetylhydrolase 1b2 (PAFAH1b2)
Type:
Protein
Mol. Mass.:
25577.50
Organism:
Mus musculus (Mouse)
Description:
Residue:
229
  
Inhibitor
Name:
BDBM154529
Synonyms:
2-(4-fluorophenyl)-1-(4-methylbenzenesulfonyl)-6-[4-(propan-2-yl)phenyl]-1,2,5,6-tetrahydropyridine-3-carboxylic acid (B6)
Type:
Small organic molecule
Emp. Form.:
C28H28FNO4S
Mol. Mass.:
493.59
SMILES:
CC(C)c1ccc(cc1)C1CC=C(C(N1S(=O)(=O)c1ccc(C)cc1)c1ccc(F)cc1)C(O)=O
: