Target
Lysine-specific demethylase 5A
Ligand
BDBM154557
Substrate
Meas. Tech.
AlphaScreen Assay
pH
8±0
Temperature
1663.9±0 K
IC50
>1.00e+5±n/a nM
Citation
 Perfetti, MTBaughman, BMDickson, BMMu, YCui, GMader, PDong, ANorris, JLRothbart, SBStrahl, BDBrown, PJJanzen, WPArrowsmith, CHMer, GMcBride, KMJames, LIFrye, SV Identification of a fragment-like small molecule ligand for the methyl-lysine binding protein, 53BP1. ACS Chem Biol 10:1072-81 (2015)  
Target
Name:
Lysine-specific demethylase 5A
Synonyms:
Histone demethylase JARID1A Jumonji/ARID domain-containing protein 1A KDM5A_HUMAN RBBP-2 RBP2 | Retinoblastoma-binding protein 2
Type:
Protein
Mol. Mass.:
192091.79
Organism:
Homo sapiens (Human)
Description:
P29375
Residue:
1690
  
Inhibitor
Name:
BDBM154557
Synonyms:
3-Bromo-N-(2-(tert-butylamino)ethyl)benzamide (13)
Type:
Small organic molecule
Emp. Form.:
C13H19BrN2O
Mol. Mass.:
299.207
SMILES:
CC(C)(C)NCCNC(=O)c1cccc(Br)c1
: