Target
MBT domain-containing protein 1
Ligand
BDBM154557
Substrate
Meas. Tech.
AlphaScreen Assay
pH
8±0
Temperature
1663.9±0 K
IC50
>1.00e+5±n/a nM
Citation
 Perfetti, MTBaughman, BMDickson, BMMu, YCui, GMader, PDong, ANorris, JLRothbart, SBStrahl, BDBrown, PJJanzen, WPArrowsmith, CHMer, GMcBride, KMJames, LIFrye, SV Identification of a fragment-like small molecule ligand for the methyl-lysine binding protein, 53BP1. ACS Chem Biol 10:1072-81 (2015)  
Target
Name:
MBT domain-containing protein 1
Synonyms:
MBT domain-containing protein 1 MBTD1 | MBTD1_HUMAN
Type:
Protein
Mol. Mass.:
70557.67
Organism:
Homo sapiens (Human)
Description:
Residue:
628
  
Inhibitor
Name:
BDBM154557
Synonyms:
3-Bromo-N-(2-(tert-butylamino)ethyl)benzamide (13)
Type:
Small organic molecule
Emp. Form.:
C13H19BrN2O
Mol. Mass.:
299.207
SMILES:
CC(C)(C)NCCNC(=O)c1cccc(Br)c1
: