Target
PHD finger protein 19
Ligand
BDBM154561
Substrate
Meas. Tech.
AlphaScreen Assay
pH
8±0
Temperature
1117.6±0 K
IC50
>1.00e+5±n/a nM
Citation
 Perfetti, MTBaughman, BMDickson, BMMu, YCui, GMader, PDong, ANorris, JLRothbart, SBStrahl, BDBrown, PJJanzen, WPArrowsmith, CHMer, GMcBride, KMJames, LIFrye, SV Identification of a fragment-like small molecule ligand for the methyl-lysine binding protein, 53BP1. ACS Chem Biol 10:1072-81 (2015)  
Target
Name:
PHD finger protein 19
Synonyms:
PCL3 PHF19 | PHF19_HUMAN
Type:
Protein
Mol. Mass.:
65617.90
Organism:
Homo sapiens (Human)
Description:
Residue:
580
  
Inhibitor
Name:
BDBM154561
Synonyms:
N-(3-(Tert-butylamino)propyl)-3-chlorobenzamide (17)
Type:
Small organic molecule
Emp. Form.:
C14H21ClN2O
Mol. Mass.:
268.782
SMILES:
CC(C)(C)NCCCNC(=O)c1cccc(Cl)c1
: