Target
PHD finger protein 23
Ligand
BDBM154558
Substrate
Meas. Tech.
AlphaScreen Assay
pH
8±0
Temperature
1117.6±0 K
IC50
>1.00e+5±n/a nM
Citation
 Perfetti, MTBaughman, BMDickson, BMMu, YCui, GMader, PDong, ANorris, JLRothbart, SBStrahl, BDBrown, PJJanzen, WPArrowsmith, CHMer, GMcBride, KMJames, LIFrye, SV Identification of a fragment-like small molecule ligand for the methyl-lysine binding protein, 53BP1. ACS Chem Biol 10:1072-81 (2015)  
Target
Name:
PHD finger protein 23
Synonyms:
PDH-containing protein JUNE-1 PHD finger protein 23 (PHF23) PHF23_HUMAN
Type:
Protein
Mol. Mass.:
43813.67
Organism:
Homo sapiens (Human)
Description:
Residue:
403
  
Inhibitor
Name:
BDBM154558
Synonyms:
N-(3-(Tert-butylamino)propyl)benzamide (14)
Type:
Small organic molecule
Emp. Form.:
C14H22N2O
Mol. Mass.:
234.3373
SMILES:
CC(C)(C)NCCCNC(=O)c1ccccc1
: