Target
Cyclin-dependent kinase 2
Ligand
BDBM154576
Substrate
Meas. Tech.
ITC Assay
pH
7.5±0
Temperature
1107.6±0 K
Kd
50.0±3.7 nM
Citation
 Alexander, LTMöbitz, HDrueckes, PSavitsky, PFedorov, OElkins, JMDeane, CMCowan-Jacob, SWKnapp, S Type II Inhibitors Targeting CDK2. ACS Chem Biol 10:2116-25 (2015)  
Target
Name:
Cyclin-dependent kinase 2
Synonyms:
CDK2 CDK2_HUMAN Cell division protein kinase 2 Protein cereblon/Cyclin-dependent kinase 2 | p33 protein kinase
Type:
Enzyme Subunit
Mol. Mass.:
33938.17
Organism:
Homo sapiens (Human)
Description:
P24941
Residue:
298
  
Inhibitor
Name:
BDBM154576
Synonyms:
K03861 (1)
Type:
Small organic molecule
Emp. Form.:
C24H26F3N7O2
Mol. Mass.:
501.5041
SMILES:
CN1CCN(Cc2ccc(NC(=O)Nc3ccc(Oc4ccnc(N)n4)cc3)cc2C(F)(F)F)CC1
: