Target
Cyclin-dependent kinase 2 [C118I]
Ligand
BDBM154576
Substrate
Meas. Tech.
EMSA
pH
7.5±n/a
IC50
>1.0e+4±n/a nM
Comments
extracted
Citation
 Alexander, LTMöbitz, HDrueckes, PSavitsky, PFedorov, OElkins, JMDeane, CMCowan-Jacob, SWKnapp, S Type II Inhibitors Targeting CDK2. ACS Chem Biol 10:2116-25 (2015)  
Target
Name:
Cyclin-dependent kinase 2 [C118I]
Synonyms:
CDK2 CDKN2 | Cyclin-dependent protein kinase 2 (CDK2 C118I)
Type:
Protein
Mol. Mass.:
33948.19
Organism:
Homo sapiens (Human)
Description:
P24941[C118I]
Residue:
298
  
Inhibitor
Name:
BDBM154576
Synonyms:
K03861 (1)
Type:
Small organic molecule
Emp. Form.:
C24H26F3N7O2
Mol. Mass.:
501.5041
SMILES:
CN1CCN(Cc2ccc(NC(=O)Nc3ccc(Oc4ccnc(N)n4)cc3)cc2C(F)(F)F)CC1
: