Target
AMP deaminase 3
Ligand
BDBM154582
Substrate
Meas. Tech.
AMPD Enzymatic Activity Assay
pH
7.4±n/a
IC50
4.4e+4± 5.8e+3 nM
Comments
extracted
Citation
 Admyre, TAmrot-Fors, LAndersson, MBauer, MBjursell, MDrmota, THallen, SHartleib-Geschwindner, JLindmark, BLiu, JLöfgren, LRohman, MSelmi, NWallenius, K Inhibition of AMP deaminase activity does not improve glucose control in rodent models of insulin resistance or diabetes. Chem Biol 21:1486-96 (2014)  
Target
Name:
AMP deaminase 3
Synonyms:
AMP deaminase 3 (rAMPD3) Ampd3
Type:
Protein
Mol. Mass.:
88489.62
Organism:
Rattus norvegicus (Rat)
Description:
Residue:
765
  
Inhibitor
Name:
BDBM154582
Synonyms:
6-[4-({[(1R)-1-(isoquinolin-8-yl)ethyl]amino}methyl)phenyl]pyridine-3-carboxylic acid (Compound 2)
Type:
Small organic molecule
Emp. Form.:
C24H21N3O2
Mol. Mass.:
383.4424
SMILES:
C[C@@H](NCc1ccc(cc1)-c1ccc(cn1)C(O)=O)c1cccc2ccncc12
: