Target
Mitogen-activated protein kinase 1
Ligand
BDBM154588
Substrate
Meas. Tech.
IMAP Assay
IC50
26.1±n/a nM
Citation
 Deng, YZhu, LShipps, Jr., GWLo, SSun, BHuang, XBienstock, CCooper, ABGao, XYao, XZhu, HYKelly, JMBoga, SBAlhassan, ATagat, JRMansoor, UFWilson, KJO'Boyle, BMDaniels, MHSchell, ASiliphaivanh, PFischer, C Heterocyclic compounds as ERK inhibitors US Patent  US8999957 Publication Date 4/7/2015 
Target
Name:
Mitogen-activated protein kinase 1
Synonyms:
ERT1 Extracellular signal-regulated kinase 2 MAP kinase 1 MAP kinase ERK2 MAPK 2 Mapk Mitogen-activated protein kinase 2 p42 | p42-MAPK
Type:
Protein
Mol. Mass.:
41278.65
Organism:
Mus musculus (Mouse)
Description:
P63085
Residue:
358
  
Inhibitor
Name:
BDBM154588
Synonyms:
US8999957, Column 141, Compound 4 | US8999957, Table 1, Compound 12
Type:
Small organic molecule
Emp. Form.:
C25H23ClFN5O
Mol. Mass.:
463.934
SMILES:
Fc1ccccc1CN1CCC[C@H](C1)NC(=O)c1ccc2[nH]nc(-c3ccnc(Cl)c3)c2c1
: