Target
Mitogen-activated protein kinase 3
Ligand
BDBM154596
Substrate
Meas. Tech.
Temperature Dependence Fluorescence Assay (TdF)
Kd
0.8±n/a nM
Citation
 Deng, YZhu, LShipps, Jr., GWLo, SSun, BHuang, XBienstock, CCooper, ABGao, XYao, XZhu, HYKelly, JMBoga, SBAlhassan, ATagat, JRMansoor, UFWilson, KJO'Boyle, BMDaniels, MHSchell, ASiliphaivanh, PFischer, C Heterocyclic compounds as ERK inhibitors US Patent  US8999957 Publication Date 4/7/2015 
Target
Name:
Mitogen-activated protein kinase 3
Synonyms:
Erk1 MK03_MOUSE Prkm3
Type:
Protein
Mol. Mass.:
43066.49
Organism:
Mus musculus (Mouse)
Description:
Q63844
Residue:
380
  
Inhibitor
Name:
BDBM154596
Synonyms:
US8999957, Column 152, Compound 1
Type:
Small organic molecule
Emp. Form.:
C24H23N5O
Mol. Mass.:
397.4723
SMILES:
O=C(NC1CNCC(C1)c1ccccc1)c1ccc2[nH]nc(-c3ccncc3)c2c1
: