Target
Mitogen-activated protein kinase 3
Ligand
BDBM154675
Substrate
Meas. Tech.
Temperature Dependence Fluorescence Assay (TdF)
Kd
0.48±n/a nM
Citation
 Deng, YZhu, LShipps, Jr., GWLo, SSun, BHuang, XBienstock, CCooper, ABGao, XYao, XZhu, HYKelly, JMBoga, SBAlhassan, ATagat, JRMansoor, UFWilson, KJO'Boyle, BMDaniels, MHSchell, ASiliphaivanh, PFischer, C Heterocyclic compounds as ERK inhibitors US Patent  US8999957 Publication Date 4/7/2015 
Target
Name:
Mitogen-activated protein kinase 3
Synonyms:
Erk1 MK03_MOUSE Prkm3
Type:
Protein
Mol. Mass.:
43066.49
Organism:
Mus musculus (Mouse)
Description:
Q63844
Residue:
380
  
Inhibitor
Name:
BDBM154675
Synonyms:
US8999957, Table 2, Compound 12
Type:
Small organic molecule
Emp. Form.:
C28H28FN5O3
Mol. Mass.:
501.552
SMILES:
CC(=O)Nc1cc(ccc1O)-c1n[nH]c2ccc(cc12)C(=O)N[C@@H]1CCCN(Cc2ccccc2F)C1
: