Target
Cytochrome P450 11B1, mitochondrial
Ligand
BDBM286336
Substrate
Meas. Tech.
HTRF-Based Assay
IC50
>8333±n/a nM
Citation
 Bennett, DJCai, JCarswell, ECooke, AHoyt, SBLondon, CMacLean, JRatcliffe, PTaylor, JAXiong, YSamanta, SKKulkarni, BA Triazolopyridyl compounds as aldosterone synthase inhibitors US Patent  US9567333 Publication Date 2/14/2017 
Target
Name:
Cytochrome P450 11B1, mitochondrial
Synonyms:
C11B1_HUMAN CYPXIB1 Cytochrome P450 11B1 Cytochrome P450 11B1, mitochondrial | S11BH
Type:
Enzyme
Mol. Mass.:
57591.44
Organism:
Homo sapiens (Human)
Description:
P15538
Residue:
503
  
Inhibitor
Name:
BDBM286336
Synonyms:
2-(5-bromopyridin-3-yl)- 5-methyl-[1,2,4] triazolo[1,5-a]pyridine | US9567333, 13
Type:
Small organic molecule
Emp. Form.:
C12H9BrN4
Mol. Mass.:
289.131
SMILES:
Cc1cccc2nc(nn12)-c1cncc(Br)c1
: