Target
Glycogen synthase kinase-3 beta
Ligand
BDBM155155
Substrate
Meas. Tech.
Inhibition Assay
pH
6.5±n/a
Temperature
298.15±n/a K
IC50
9.4±n/a nM
Comments
extracted
Citation
 Nakayama, KSakai, DWatanabe, KKohara, TAritomo, K Pyrimidone derivatives US Patent  US9006232 Publication Date 4/14/2015 
Target
Name:
Glycogen synthase kinase-3 beta
Synonyms:
Glycogen synthase kinase-3 beta (GSK3beta) | Tau protein kinase 1 (TPK1)
Type:
Protein
Mol. Mass.:
46641.23
Organism:
Bos taurus (cattle)
Description:
A0A059UE90
Residue:
419
  
Inhibitor
Name:
BDBM155155
Synonyms:
US9006232, 1.101
Type:
Small organic molecule
Emp. Form.:
C20H21N5O2
Mol. Mass.:
363.413
SMILES:
Cn1c(OC2CCCN(C2)c2ccccc2)nc(cc1=O)-c1ccncn1
: