Target
Glycogen synthase kinase-3 beta
Ligand
BDBM155167
Substrate
Meas. Tech.
Inhibition Assay
pH
6.5±n/a
Temperature
298.15±n/a K
IC50
19.1±n/a nM
Comments
extracted
Citation
 Nakayama, KSakai, DWatanabe, KKohara, TAritomo, K Pyrimidone derivatives US Patent  US9006232 Publication Date 4/14/2015 
Target
Name:
Glycogen synthase kinase-3 beta
Synonyms:
Glycogen synthase kinase-3 beta (GSK3beta) | Tau protein kinase 1 (TPK1)
Type:
Protein
Mol. Mass.:
46641.23
Organism:
Bos taurus (cattle)
Description:
A0A059UE90
Residue:
419
  
Inhibitor
Name:
BDBM155167
Synonyms:
US9006232, 1.201
Type:
Small organic molecule
Emp. Form.:
C30H39N7O4
Mol. Mass.:
561.6752
SMILES:
Cn1c(OC2CCN(CC2)c2ccc(CN3CCN(CC3)C(=O)OC(C)(C)C)cc2)nc(cc1=O)-c1ccncn1
: