Target
Glycogen synthase kinase-3 beta
Ligand
BDBM155173
Substrate
Meas. Tech.
Inhibition Assay
pH
6.5±n/a
Temperature
298.15±n/a K
IC50
32.6±n/a nM
Comments
extracted
Citation
 Nakayama, KSakai, DWatanabe, KKohara, TAritomo, K Pyrimidone derivatives US Patent  US9006232 Publication Date 4/14/2015 
Target
Name:
Glycogen synthase kinase-3 beta
Synonyms:
Glycogen synthase kinase-3 beta (GSK3beta) | Tau protein kinase 1 (TPK1)
Type:
Protein
Mol. Mass.:
46641.23
Organism:
Bos taurus (cattle)
Description:
A0A059UE90
Residue:
419
  
Inhibitor
Name:
BDBM155173
Synonyms:
US9006232, 1.207
Type:
Small organic molecule
Emp. Form.:
C26H24FN5O2
Mol. Mass.:
457.4995
SMILES:
Cn1c(OC2CCN(CC2)c2ccc(cc2)-c2ccncc2)nc(cc1=O)-c1ccncc1F
: