Target
Glycogen synthase kinase-3 beta
Ligand
BDBM155202
Substrate
Meas. Tech.
Inhibition Assay
pH
6.5±n/a
Temperature
298.15±n/a K
IC50
14.9±n/a nM
Comments
extracted
Citation
 Nakayama, KSakai, DWatanabe, KKohara, TAritomo, K Pyrimidone derivatives US Patent  US9006232 Publication Date 4/14/2015 
Target
Name:
Glycogen synthase kinase-3 beta
Synonyms:
Glycogen synthase kinase-3 beta (GSK3beta) | Tau protein kinase 1 (TPK1)
Type:
Protein
Mol. Mass.:
46641.23
Organism:
Bos taurus (cattle)
Description:
A0A059UE90
Residue:
419
  
Inhibitor
Name:
BDBM155202
Synonyms:
US9006232, 1.302
Type:
Small organic molecule
Emp. Form.:
C26H33N7O2
Mol. Mass.:
475.5859
SMILES:
CN1CCN(Cc2ccccc2N2CCC(CC2)Oc2nc(cc(=O)n2C)-c2ccncn2)CC1
: