Target
Proto-oncogene tyrosine-protein kinase Src
Ligand
BDBM5061
Substrate
Src SH2 Binding Substrate
Meas. Tech.
Competitive Binding Assay
pH
7.4±n/a
Temperature
295.15±n/a K
IC50
>500000±n/a nM
Citation
 Vu, CBCorpuz, EGMerry, TJPradeepan, SGBartlett, CBohacek, RSBotfield, MCEyermann, CJLynch, BAMacNeil, IARam, MKvan Schravendijk, MRViolette, SSawyer, TK Discovery of potent and selective SH2 inhibitors of the tyrosine kinase ZAP-70. J Med Chem 42:4088-98 (1999)  
Target
Name:
Proto-oncogene tyrosine-protein kinase Src
Synonyms:
Calmodulin/Proto-oncogene tyrosine-protein kinase Src Proto-oncogene c-Src SRC SRC_HUMAN V-src sarcoma (Schmidt-Ruppin A-2) viral oncogene homolog (avian) p60-Src | pp60c-src
Type:
Protein
Mol. Mass.:
59838.60
Organism:
Homo sapiens (Human)
Description:
P12931
Residue:
536
  
Inhibitor
Name:
BDBM5061
Synonyms:
1,2,4-Oxadiazole Analogue 4g | 4-[(2S)-2-{[(1S)-3-carbamoyl-1-{3-[(2,4-dichlorophenyl)methyl]-1,2,4-oxadiazol-5-yl}propyl]carbamoyl}-2-acetamidoethyl]phenoxyphosphonic acid
Type:
Small organic molecule
Emp. Form.:
C24H26Cl2N5O8P
Mol. Mass.:
614.372
SMILES:
CC(=O)N[C@@H](Cc1ccc(OP(O)(O)=O)cc1)C(=O)N[C@@H](CCC(N)=O)c1nc(Cc2ccc(Cl)cc2Cl)no1
:
Substrate
Name:
Src SH2 Binding Substrate
Synonyms:
Type:
Peptide
Mol. Mass.:
1709.42
Organism:
Description:
Residue:
13
FLRPYPYPYIENH