Target
Dihydroorotate dehydrogenase (quinone), mitochondrial
Ligand
BDBM155503
Substrate
Meas. Tech.
Enzyme Assay
pH
8±n/a
IC50
314±n/a nM
Comments
extracted
Citation
 Thunuguntla, SSSubramanya, HKunnam, SRSanivaru Vijay, SRBingi, CKusanur, RSchwarz, MArlt, M Dihydroorotate dehydrogenase inhibitors US Patent  US9006454 Publication Date 4/14/2015 
Target
Name:
Dihydroorotate dehydrogenase (quinone), mitochondrial
Synonyms:
DHODH Dihydroorotate dehydrogenase Dihydroorotate dehydrogenase, mitochondrial Dihydroorotate oxidase (DHODH) | PYRD_HUMAN
Type:
Enzyme
Mol. Mass.:
42881.33
Organism:
Homo sapiens (Human)
Description:
Q02127
Residue:
395
  
Inhibitor
Name:
BDBM155503
Synonyms:
US9006454, I145
Type:
Small organic molecule
Emp. Form.:
C21H10F6N2O2
Mol. Mass.:
436.3067
SMILES:
Cc1cc(C(O)=O)c2nc([nH]c2c1)-c1c(F)c(F)c(-c2ccc(F)c(F)c2)c(F)c1F
: