Target
Fibroblast growth factor receptor 1
Ligand
BDBM286986
Substrate
Meas. Tech.
Caliper-Based Kinase Assay
Temperature
298.15±n/a K
IC50
1.10±n/a nM
Comments
extracted
Citation
 Verner, EBrameld, KA Quinolone derivatives as fibroblast growth factor receptor inhibitors US Patent  US9567334 Publication Date 2/14/2017 
Target
Name:
Fibroblast growth factor receptor 1
Synonyms:
BFGFR Basic fibroblast growth factor receptor 1 (FGFR1) CEK FGFR-1 FGFR-1, (FL) FGFR1_HUMAN FLT2 Fibroblast growth factor receptor 1 (FGFR-1) Fms-like tyrosine kinase 2 N-sam bFGF-R | c-fgr
Type:
Receptor
Mol. Mass.:
91861.70
Organism:
Homo sapiens (Human)
Description:
P11362
Residue:
822
  
Inhibitor
Name:
BDBM286986
Synonyms:
8-(3-(4-acryloylpiperazin-1-yl)propyl)-6-(2-chloro-3,5-dimethoxyphenyl)-2-(phenylamino)pyrido[2,3-d]pyrimidin-7(8H)-one US11078199, Cpd 26 | US9567334, Example 26
Type:
Small organic molecule
Emp. Form.:
C31H33ClN6O4
Mol. Mass.:
589.085
SMILES:
COc1cc(OC)c(Cl)c(c1)-c1cc2cnc(Nc3ccccc3)nc2n(CCCN2CCN(CC2)C(=O)C=C)c1=O
: