Target
Fibroblast growth factor receptor 1
Ligand
BDBM287041
Substrate
Meas. Tech.
Caliper-Based Kinase Assay
Temperature
298.15±n/a K
IC50
1.60±n/a nM
Comments
extracted
Citation
 Verner, EBrameld, KA Quinolone derivatives as fibroblast growth factor receptor inhibitors US Patent  US9567334 Publication Date 2/14/2017 
Target
Name:
Fibroblast growth factor receptor 1
Synonyms:
BFGFR Basic fibroblast growth factor receptor 1 (FGFR1) CEK FGFR-1 FGFR-1, (FL) FGFR1_HUMAN FLT2 Fibroblast growth factor receptor 1 (FGFR-1) Fms-like tyrosine kinase 2 N-sam bFGF-R | c-fgr
Type:
Receptor
Mol. Mass.:
91861.70
Organism:
Homo sapiens (Human)
Description:
P11362
Residue:
822
  
Inhibitor
Name:
BDBM287041
Synonyms:
8-(3-(4-acryloylpiperazin-1-yl)propyl)-6-(2,6-dichloro-3,5-dimethoxyphenyl)-2-((2-methoxyethyl)amino)pyrido[2,3-d]pyrimidin-7(8H)-one US11078199, Cpd 45 US9815834, Compound 45
Type:
Small organic molecule
Emp. Form.:
C28H34Cl2N6O5
Mol. Mass.:
605.513
SMILES:
COCCNc1ncc2cc(-c3c(Cl)c(OC)cc(OC)c3Cl)c(=O)n(CCCN3CCN(CC3)C(=O)C=C)c2n1
: