Target
Fibroblast growth factor receptor 1
Ligand
BDBM287525
Substrate
Meas. Tech.
Caliper-Based Kinase Assay
Temperature
298.15±n/a K
IC50
11.9±n/a nM
Comments
extracted
Citation
 Verner, EBrameld, KA Quinolone derivatives as fibroblast growth factor receptor inhibitors US Patent  US9567334 Publication Date 2/14/2017 
Target
Name:
Fibroblast growth factor receptor 1
Synonyms:
BFGFR Basic fibroblast growth factor receptor 1 (FGFR1) CEK FGFR-1 FGFR-1, (FL) FGFR1_HUMAN FLT2 Fibroblast growth factor receptor 1 (FGFR-1) Fms-like tyrosine kinase 2 N-sam bFGF-R | c-fgr
Type:
Receptor
Mol. Mass.:
91861.70
Organism:
Homo sapiens (Human)
Description:
P11362
Residue:
822
  
Inhibitor
Name:
BDBM287525
Synonyms:
8-(2-((1-acryloylazetidin-3-yl)oxy)ethyl)-6-(2,6-dichloro-3,5-dimethoxyphenyl)-2-((2-(pyrrolidin-1-yl)ethyl)amino)pyrido[2,3-d]pyrimidin-7(8H)-one US11078199, Cpd 93 | US9567334, Example 93
Type:
Small organic molecule
Emp. Form.:
C29H34Cl2N6O5
Mol. Mass.:
617.523
SMILES:
COc1cc(OC)c(Cl)c(c1Cl)-c1cc2cnc(NCCN3CCCC3)nc2n(CCOC2CN(C2)C(=O)C=C)c1=O
: