Target
Focal adhesion kinase 1
Ligand
BDBM155548
Substrate
Meas. Tech.
Biochemical Assay
pH
7±n/a
IC50
3.9±n/a nM
Comments
extracted
Citation
 Holmes, IPBergman, YLunniss, GENikac, MChoi, NHemley, CFWalker, SRFoitzik, RCGaname, DLessene, R FAK inhibitors US Patent  US9012461 Publication Date 4/21/2015 
Target
Name:
Focal adhesion kinase 1
Synonyms:
FADK 1 FAK1 FLT4 Focal adhesion kinase (FAK) Focal adhesion kinase 1 (FAK) Focal adhesion kinase-related nonkinase PTK2 Protein-tyrosine kinase 2 p125FAK | pp125FAK
Type:
Tyrosine-protein kinase
Mol. Mass.:
119233.17
Organism:
Homo sapiens (Human)
Description:
Q05397
Residue:
1052
  
Inhibitor
Name:
BDBM155548
Synonyms:
US9012461, 24
Type:
Small organic molecule
Emp. Form.:
C28H30F3N5O2
Mol. Mass.:
525.5653
SMILES:
CC(=O)C1CCN(CC1)c1ccc(Nc2ncc(c(CCc3ccccc3CC(N)=O)n2)C(F)(F)F)cc1
: