Target
Focal adhesion kinase 1
Ligand
BDBM155561
Substrate
Meas. Tech.
Biochemical Assay
pH
7±n/a
IC50
254±n/a nM
Comments
extracted
Citation
 Holmes, IPBergman, YLunniss, GENikac, MChoi, NHemley, CFWalker, SRFoitzik, RCGaname, DLessene, R FAK inhibitors US Patent  US9012461 Publication Date 4/21/2015 
Target
Name:
Focal adhesion kinase 1
Synonyms:
FADK 1 FAK1 FLT4 Focal adhesion kinase (FAK) Focal adhesion kinase 1 (FAK) Focal adhesion kinase-related nonkinase PTK2 Protein-tyrosine kinase 2 p125FAK | pp125FAK
Type:
Tyrosine-protein kinase
Mol. Mass.:
119233.17
Organism:
Homo sapiens (Human)
Description:
Q05397
Residue:
1052
  
Inhibitor
Name:
BDBM155561
Synonyms:
US9012461, 37
Type:
Small organic molecule
Emp. Form.:
C25H27F3N6O
Mol. Mass.:
484.5167
SMILES:
NC(=O)c1cccc(CCc2nc(Nc3ccc(CN4CCNCC4)cc3)ncc2C(F)(F)F)c1
: