Target
Transient receptor potential cation channel subfamily V member 3
Ligand
BDBM155846
Substrate
Meas. Tech.
Calcium Flux Assay
IC50
120±n/a nM
Citation
 Clapham, BCox, PBDart, MJGomtsyan, AJinkerson, TKKeddy, RGKort, MEKym, PRMatulenko, MSchmidt, RGVillamil, CIVoight, EAWoller, KR TRPV3 modulators US Patent  US9012651 Publication Date 4/21/2015 
Target
Name:
Transient receptor potential cation channel subfamily V member 3
Synonyms:
TRPV3 Transient receptor potential cation channel subfamily V member 3 (TRPV3) | Vanilloid receptor-like 3
Type:
Enzyme
Mol. Mass.:
90635.51
Organism:
Homo sapiens (Human)
Description:
Q8NET8
Residue:
790
  
Inhibitor
Name:
BDBM155846
Synonyms:
US9012651, 294
Type:
Small organic molecule
Emp. Form.:
C17H19ClF2N2O
Mol. Mass.:
340.795
SMILES:
CC(C)[C@H](CO)NCc1nc(ccc1F)-c1ccc(F)c(Cl)c1
: