Target
Baculoviral IAP repeat-containing protein 2
Ligand
BDBM156086
Substrate
Meas. Tech.
In vitro Competitive Displacement Binding Assays
pH
7.5±n/a
Temperature
298.15±n/a K
IC50
14±n/a nM
Comments
extracted
Citation
 Woolford, AJHoward, SBuck, IMChessari, GJohnson, CNTamanini, EDay, JEChiarparin, EHeightman, TDFrederickson, MGriffiths-Jones, CM Bicyclic heterocycle compounds and their uses in therapy US Patent  US9018214 Publication Date 4/28/2015 
Target
Name:
Baculoviral IAP repeat-containing protein 2
Synonyms:
API1 BIRC2_HUMAN Cellular inhibitor of apoptosis 1 MIHB | RNF48
Type:
Protein
Mol. Mass.:
69900.47
Organism:
Homo sapiens (Human)
Description:
Q13490
Residue:
618
  
Inhibitor
Name:
BDBM156086
Synonyms:
US9018214, 137
Type:
Small organic molecule
Emp. Form.:
C25H34N4O2
Mol. Mass.:
422.5631
SMILES:
COC[C@H]1CN[C@H](C)CN1CC(=O)N1CC(C)(C)c2ncc(Cc3ccccc3)cc12
: