Target
Bcl-2-like protein 1
Ligand
BDBM156399
Substrate
Meas. Tech.
Fluorescence Polarization
IC50
3±n/a nM
Citation
 Diebold, RBGero, TGrover, PHuang, SIoannidis, SOgoe, CASaeh, JC Chemical compounds US Patent  US9018381 Publication Date 4/28/2015 
Target
Name:
Bcl-2-like protein 1
Synonyms:
Anti-apoptotic Bcl-2 protein Apoptosis regulator Bcl-X BCL2-like 1 isoform 1 BCL2L1 Bcl-2-like protein 1 (Bcl-XL) Bcl-xL/Bcl-2-binding component 3 Bcl2-antagonist of cell death (BAD)
Type:
Mitochondrion membrane; Single-pass membrane protein
Mol. Mass.:
26039.60
Organism:
Homo sapiens (Human)
Description:
Residue:
233
  
Inhibitor
Name:
BDBM156399
Synonyms:
US9018381, 22 | US9248140, 22
Type:
Small organic molecule
Emp. Form.:
C47H50ClF3N4O8S3
Mol. Mass.:
987.565
SMILES:
OC[C@H]1CN(CC[C@H](CSc2ccccc2)Nc2ccc(cc2S(=O)(=O)C(F)(F)F)S(=O)(=O)NC(=O)c2ccc(cc2)N2CCC(CC2)[C@@H](O)c2ccccc2-c2ccc(Cl)cc2)CCO1
: