Target
Bcl-2-like protein 1
Ligand
BDBM156407
Substrate
Meas. Tech.
Fluorescence Polarization
IC50
1±n/a nM
Citation
 Diebold, RBGero, TGrover, PHuang, SIoannidis, SOgoe, CASaeh, JC Chemical compounds US Patent  US9018381 Publication Date 4/28/2015 
Target
Name:
Bcl-2-like protein 1
Synonyms:
Anti-apoptotic Bcl-2 protein Apoptosis regulator Bcl-X BCL2-like 1 isoform 1 BCL2L1 Bcl-2-like protein 1 (Bcl-XL) Bcl-xL/Bcl-2-binding component 3 Bcl2-antagonist of cell death (BAD)
Type:
Mitochondrion membrane; Single-pass membrane protein
Mol. Mass.:
26039.60
Organism:
Homo sapiens (Human)
Description:
Residue:
233
  
Inhibitor
Name:
BDBM156407
Synonyms:
US9018381, 30 | US9248140, 30
Type:
Small organic molecule
Emp. Form.:
C47H51ClF3N4O10PS3
Mol. Mass.:
1051.546
SMILES:
COP(O)(=O)O[C@H](C1CCN(CC1)c1ccc(cc1)C(=O)NS(=O)(=O)c1ccc(N[C@H](CCN2CCOCC2)CSc2ccccc2)c(c1)S(=O)(=O)C(F)(F)F)c1ccccc1-c1ccc(Cl)cc1
: