Target
Xanthine dehydrogenase/oxidase
Ligand
BDBM157887
Substrate
Meas. Tech.
Inhibition Assay
Temperature
298.15±n/a K
IC50
2.1±n/a nM
Comments
extracted
Citation
 Shimizu, KTakigawa, YFujikura, HIizuka, MHiratochi, MKikuchi, N 5-membered nitrogen containing heterocyclic derivatives and pharmaceutical compositions comprising the same US Patent  US9023882 Publication Date 5/5/2015 
Target
Name:
Xanthine dehydrogenase/oxidase
Synonyms:
XDH Xanthine dehydrogenase Xanthine oxidase (XO)
Type:
Protein
Mol. Mass.:
146809.00
Organism:
Bos taurus (Bovine)
Description:
P80457
Residue:
1332
  
Inhibitor
Name:
BDBM157887
Synonyms:
US9023882, 160
Type:
Small organic molecule
Emp. Form.:
C20H14N2O5
Mol. Mass.:
362.3356
SMILES:
OC(=O)COc1ccc(cc1)-c1cn(cc1C#N)-c1ccc(cc1)C(O)=O
: