Target
Androgen receptor
Ligand
BDBM143716
Substrate
Meas. Tech.
Androgen Receptor Assay
pH
7.4±n/a
Temperature
298.15±n/a K
IC50
100±n/a nM
Comments
extracted
Citation
 Labrie, FSingh, SMLabrecque, RCiobanu, LC Non-steroidal antiandrogens and selective androgen receptor modulators with a pyridyl moiety US Patent  US9682960 Publication Date 6/20/2017 
Target
Name:
Androgen receptor
Synonyms:
ANDR_MOUSE Nr3c4
Type:
PROTEIN
Mol. Mass.:
98196.62
Organism:
Mus musculus
Description:
ChEMBL_945930
Residue:
899
  
Inhibitor
Name:
BDBM143716
Synonyms:
US9682960, EM-9260
Type:
Small organic molecule
Emp. Form.:
C12H10ClN3O2
Mol. Mass.:
263.68
SMILES:
CC1(C)NC(=O)N(C1=O)c1ccc(C#N)c(Cl)c1
: