Target
Androgen receptor
Ligand
BDBM146873
Substrate
Meas. Tech.
Androgen Receptor Assay
pH
7.4±n/a
Temperature
298.15±n/a K
IC50
11±n/a nM
Comments
extracted
Citation
 Labrie, FSingh, SMLabrecque, RCiobanu, LC Non-steroidal antiandrogens and selective androgen receptor modulators with a pyridyl moiety US Patent  US9682960 Publication Date 6/20/2017 
Target
Name:
Androgen receptor
Synonyms:
ANDR_MOUSE Nr3c4
Type:
PROTEIN
Mol. Mass.:
98196.62
Organism:
Mus musculus
Description:
ChEMBL_945930
Residue:
899
  
Inhibitor
Name:
BDBM146873
Synonyms:
US9682960, EM-9221
Type:
Small organic molecule
Emp. Form.:
C27H25ClN4O4
Mol. Mass.:
504.965
SMILES:
Cc1cc(OCCCN2C(=O)N(C(=O)C2(C)C)c2ccc(C#N)c(Cl)c2)ccc1-c1cc[n+]([O-])cc1
: