Target
Tyrosine-protein kinase BTK [393-659]
Ligand
BDBM287397
Substrate
Meas. Tech.
Time-Resolved Fluorescence Resonance Energy Transfer (TR-FRET)
pH
6.5±n/a
Temperature
298.15±n/a K
IC50
<100±n/a nM
Comments
extracted
Citation
 Bonafoux, DDavis, HMFrank, KEFriedman, MMHerold, JMHoemann, MZHuntley, ROsuma, ASheppard, GSomal, GKVan Camp, JVan Epps, SAVasudevan, AWallace, GAWang, LWang, LWang, ZWilson, NSXu, X Primary carboxamides as BTK inhibitors US Patent  US9567339 Publication Date 2/14/2017 
Target
Name:
Tyrosine-protein kinase BTK [393-659]
Synonyms:
AGMX1 BPK BTK_HUMAN | Tyrosine-protein kinase BTK
Type:
Enzyme Catalytic Domain
Mol. Mass.:
31165.48
Organism:
Homo sapiens (Human)
Description:
aa 393-659
Residue:
267
  
Inhibitor
Name:
BDBM287397
Synonyms:
US9567339, Example E.6.1
Type:
Small organic molecule
Emp. Form.:
C31H27N5O4
Mol. Mass.:
533.5772
SMILES:
CCOC(=O)N1CC=C(C1)c1cc2c(ccc(C(N)=O)c2[nH]1)-c1cccc(c1C)-n1cnc2ccccc2c1=O
: