Target
Beta-secretase 1
Ligand
BDBM143223
Substrate
Meas. Tech.
HTRF FRET Assay
pH
5±n/a
Temperature
303.15±n/a K
Ki
3±n/a nM
Comments
extracted
Citation
 Scott, JDStamford, AWGilbert, EJCumming, JN Iminothiadiazine dioxide compounds as brace inhibitors, compositions, and their use US Patent  US9029362 Publication Date 5/12/2015 
Target
Name:
Beta-secretase 1
Synonyms:
ASP2 Aspartyl protease 2 BACE1 Beta-secretase (BACE) Beta-secretase 1 (BACE 1) Beta-secretase 1 (BACE1) Beta-site amyloid precursor protein cleaving enzyme 1 Memapsin-2 beta-Secretase (BACE-1) | beta-Secretase (BACE1)
Type:
Protein
Mol. Mass.:
55755.10
Organism:
Homo sapiens (Human)
Description:
P56817
Residue:
501
  
Inhibitor
Name:
BDBM143223
Synonyms:
US8940748, 35 US9687494, 35
Type:
Small organic molecule
Emp. Form.:
C18H20FN5O3S
Mol. Mass.:
405.447
SMILES:
CN1C(=N)N[C@@](C)(CS1(=O)=O)c1cc(NC(=O)c2ccc(C)cn2)ccc1F
: