Target
Beta-secretase 2
Ligand
BDBM143227
Substrate
Meas. Tech.
HTRF FRET Assay
pH
5±n/a
Temperature
303.15±n/a K
Ki
0.37±n/a nM
Comments
extracted
Citation
 Scott, JDStamford, AWGilbert, EJCumming, JN Iminothiadiazine dioxide compounds as brace inhibitors, compositions, and their use US Patent  US9029362 Publication Date 5/12/2015 
Target
Name:
Beta-secretase 2
Synonyms:
AEPLC ASP1 Asp 1 Aspartyl protease 1 BACE2_HUMAN Beta-secretase (BACE) Beta-secretase 2 (BACE-2) Beta-site APP-cleaving enzyme 2 Memapsin-1 beta-Secretase (BACE-2)
Type:
Protein
Mol. Mass.:
56171.20
Organism:
Homo sapiens (Human)
Description:
Q9Y5Z0
Residue:
518
  
Inhibitor
Name:
BDBM143227
Synonyms:
US8940748, 52 US9687494, 52
Type:
Small organic molecule
Emp. Form.:
C17H17ClN4O2S2
Mol. Mass.:
408.925
SMILES:
CC#Cc1cncc(c1)-c1cc(Cl)c(s1)[C@]1(C)CS(=O)(=O)N(C)C(=N)N1
: