Target
Vascular endothelial growth factor receptor 2
Ligand
BDBM287567
Substrate
Meas. Tech.
VEGFR2 Kinase Assay
pH
7.4±n/a
IC50
2.00±n/a nM
Comments
extracted
Citation
 Boral, SWang, SMalone, TCWurster, JShen, JRobinson, M Substituted nicotinamide derivatives as kinase inhibitors US Patent  US9567324 Publication Date 2/14/2017 
Target
Name:
Vascular endothelial growth factor receptor 2
Synonyms:
CD_antigen=CD309 Fetal liver kinase 1 (FLK-1) KDR Protein-tyrosine kinase receptor Flk-1 VEGFR-2 VEGFR2 Vascular Endothelial Growth Factor Receptor Kinase 2 Vascular endothelial growth factor receptor 2 (KDR) Vascular endothelial growth factor receptor 2 (VEGFR2) Vascular endothelial growth factor receptor-2 (VEGFR-2)
Type:
Receptor Tyrosine Kinase
Mol. Mass.:
151510.97
Organism:
Homo sapiens (Human)
Description:
P35968
Residue:
1356
  
Inhibitor
Name:
BDBM287567
Synonyms:
US9567324, 7
Type:
Small organic molecule
Emp. Form.:
C29H29N5O7S
Mol. Mass.:
591.635
SMILES:
Cc1ccoc1C(=O)Nc1cccc(c1)C#Cc1cncc(c1)C(=O)N=S1(=O)CCN(CC1)C(=O)NCCCC(O)=O
: