Target
Vascular endothelial growth factor receptor 2
Ligand
BDBM287582
Substrate
Meas. Tech.
VEGFR2 Kinase Assay
pH
7.4±n/a
IC50
14.0±n/a nM
Comments
extracted
Citation
 Boral, SWang, SMalone, TCWurster, JShen, JRobinson, M Substituted nicotinamide derivatives as kinase inhibitors US Patent  US9567324 Publication Date 2/14/2017 
Target
Name:
Vascular endothelial growth factor receptor 2
Synonyms:
CD_antigen=CD309 Fetal liver kinase 1 (FLK-1) KDR Protein-tyrosine kinase receptor Flk-1 VEGFR-2 VEGFR2 Vascular Endothelial Growth Factor Receptor Kinase 2 Vascular endothelial growth factor receptor 2 (KDR) Vascular endothelial growth factor receptor 2 (VEGFR2) Vascular endothelial growth factor receptor-2 (VEGFR-2)
Type:
Receptor Tyrosine Kinase
Mol. Mass.:
151510.97
Organism:
Homo sapiens (Human)
Description:
P35968
Residue:
1356
  
Inhibitor
Name:
BDBM287582
Synonyms:
US9567324, 22
Type:
Small organic molecule
Emp. Form.:
C26H23FN4O4S
Mol. Mass.:
506.549
SMILES:
Cc1ccc(F)c(NC(=O)c2cccc(c2)C#Cc2cc(cnc2N)C(=O)N=S2(=O)CCOCC2)c1
: