Target
Glutamate receptor ionotropic, NMDA 2A
Ligand
BDBM287593
Substrate
Meas. Tech.
CYP P450 Enzyme Inhibition
pH
7.4±n/a
IC50
>10000000±n/a nM
Comments
extracted
Citation
 Shapiro, G Pyrrolopyrimidine derivatives as NR2B NMDA receptor antagonists US Patent  US9567341 Publication Date 2/14/2017 
Target
Name:
Glutamate receptor ionotropic, NMDA 2A
Synonyms:
GRIN2A Glutamate [NMDA] receptor Glutamate [NMDA] receptor subunit epsilon-1 NMDA receptor subtype 2A protein (NR2A) NMDE1_HUMAN hNR2A
Type:
Mol. Mass.:
165293.76
Organism:
Homo sapiens (Human)
Description:
Residue:
1464
  
Inhibitor
Name:
BDBM287593
Synonyms:
US10420768, Compound C-47 | US9567341, Compound C-47
Type:
Small organic molecule
Emp. Form.:
C20H24F2N6
Mol. Mass.:
386.4416
SMILES:
CN(C1CCN(CC(F)(F)c2ccc(C)cn2)CC1)c1ncnc2[nH]ccc12
: