Target
Glutamate receptor ionotropic, NMDA 2A
Ligand
BDBM287603
Substrate
Meas. Tech.
CYP P450 Enzyme Inhibition
pH
7.4±n/a
IC50
>10000000±n/a nM
Comments
extracted
Citation
 Shapiro, G Pyrrolopyrimidine derivatives as NR2B NMDA receptor antagonists US Patent  US9567341 Publication Date 2/14/2017 
Target
Name:
Glutamate receptor ionotropic, NMDA 2A
Synonyms:
GRIN2A Glutamate [NMDA] receptor Glutamate [NMDA] receptor subunit epsilon-1 NMDA receptor subtype 2A protein (NR2A) NMDE1_HUMAN hNR2A
Type:
Mol. Mass.:
165293.76
Organism:
Homo sapiens (Human)
Description:
Residue:
1464
  
Inhibitor
Name:
BDBM287603
Synonyms:
BDBM393497 BDBM617007 | US9567341, Compound C-179
Type:
Small organic molecule
Emp. Form.:
C20H21F4N5
Mol. Mass.:
407.4079
SMILES:
FC(F)c1ccc(cc1)C(F)(F)CN1CCC(CC1)Nc1ncnc2[nH]ccc12
: