Target
P2X purinoceptor 7
Ligand
BDBM160104
Substrate
Meas. Tech.
Radioligand Binding Assay
Ki
6.3±n/a nM
Citation
 Ameriks, MKRech, JCSavall, BM [1,2,4]triazolo[4,3-a]pyrazines as P2X7 modulators US Patent  US9040534 Publication Date 5/26/2015 
Target
Name:
P2X purinoceptor 7
Synonyms:
ATP receptor P2RX7_HUMAN P2X purinoceptor 7 (P2X7) P2Z receptor | Purinergic receptor
Type:
Protein
Mol. Mass.:
68602.85
Organism:
Homo sapiens (Human)
Description:
Q99572
Residue:
595
  
Inhibitor
Name:
BDBM160104
Synonyms:
US10047092, 45 US9040534, 45
Type:
Small organic molecule
Emp. Form.:
C19H14ClF4N5O
Mol. Mass.:
439.794
SMILES:
C[C@H]1Cn2c(nnc2-c2cncc(F)c2)C(=O)N1Cc1cccc(c1Cl)C(F)(F)F
: