Target
P2X purinoceptor 7
Ligand
BDBM160135
Substrate
Meas. Tech.
Radioligand Binding Assay
Ki
2.5±n/a nM
Citation
 Ameriks, MKRech, JCSavall, BM [1,2,4]triazolo[4,3-a]pyrazines as P2X7 modulators US Patent  US9040534 Publication Date 5/26/2015 
Target
Name:
P2X purinoceptor 7
Synonyms:
ATP receptor P2RX7_HUMAN P2X purinoceptor 7 (P2X7) P2Z receptor | Purinergic receptor
Type:
Protein
Mol. Mass.:
68602.85
Organism:
Homo sapiens (Human)
Description:
Q99572
Residue:
595
  
Inhibitor
Name:
BDBM160135
Synonyms:
US10047092, 76 US9040534, 76
Type:
Small organic molecule
Emp. Form.:
C20H16ClF4N5O
Mol. Mass.:
453.821
SMILES:
CC[C@H]1Cn2c(nnc2-c2ccc(F)cn2)C(=O)N1Cc1cccc(c1Cl)C(F)(F)F
: