Target
Serine/threonine-protein kinase receptor R3
Ligand
BDBM160289
Substrate
Meas. Tech.
Flashplate Assay
IC50
2±n/a nM
Citation
 Klar, JVöhringer, VTelser, JLobell, MSüβmeier, FLi, VMBöttger, MGolz, SLang, DSchlemmer, KSchlange, TSchall, AFu, W Hydroxymethylaryl-substituted pyrrolotriazines as ALK1 inhibitors US Patent  US9040691 Publication Date 5/26/2015 
Target
Name:
Serine/threonine-protein kinase receptor R3
Synonyms:
ACVL1_HUMAN ACVRLK1 Activin receptor-like kinase 1 (ALK-1) | Serine/threonine-protein kinase receptor R3 (ALK1)
Type:
Enzyme
Mol. Mass.:
56134.46
Organism:
Homo sapiens (Human)
Description:
P37023
Residue:
503
  
Inhibitor
Name:
BDBM160289
Synonyms:
US9040691, 17
Type:
Small organic molecule
Emp. Form.:
C16H14N6OS
Mol. Mass.:
338.387
SMILES:
Nc1nc(cs1)-c1cc(-c2ccc(CO)cc2)c2c(N)ncnn12
: