Target
Cytochrome P450 11B2, mitochondrial
Ligand
BDBM287626
Substrate
Meas. Tech.
Metalloenzyme Activity
IC50
<100±n/a nM
Citation
 Sparks, SYates, CMShaver, SRHoekstra, WJ Metalloenzyme inhibitor compounds US Patent  US10085984 Publication Date 10/2/2018 
Target
Name:
Cytochrome P450 11B2, mitochondrial
Synonyms:
Aldosterone Synthase (CYP11B2) Aldosterone-synthesizing enzyme CYP11B2 Cytochrome P450 11B2 Cytochrome P450 11B2, mitochondrial P-450C18 | Steroid 18-hydroxylase
Type:
Protein
Mol. Mass.:
57582.15
Organism:
Homo sapiens (Human)
Description:
P19099
Residue:
503
  
Inhibitor
Name:
BDBM287626
Synonyms:
US10085984, Example 4 | US11040034, Ex. No. 4
Type:
Small organic molecule
Emp. Form.:
C16H13FN4
Mol. Mass.:
280.2996
SMILES:
Fc1ccc2nc(-c3cnnc(C=C)c3)n(C3CC3)c2c1
: