Target
Cytochrome P450 11B2, mitochondrial
Ligand
BDBM287633
Substrate
Meas. Tech.
Metalloenzyme Activity
IC50
<100±n/a nM
Citation
 Sparks, SYates, CMShaver, SRHoekstra, WJ Metalloenzyme inhibitor compounds US Patent  US10085984 Publication Date 10/2/2018 
Target
Name:
Cytochrome P450 11B2, mitochondrial
Synonyms:
Aldosterone Synthase (CYP11B2) Aldosterone-synthesizing enzyme CYP11B2 Cytochrome P450 11B2 Cytochrome P450 11B2, mitochondrial P-450C18 | Steroid 18-hydroxylase
Type:
Protein
Mol. Mass.:
57582.15
Organism:
Homo sapiens (Human)
Description:
P19099
Residue:
503
  
Inhibitor
Name:
BDBM287633
Synonyms:
US10085984, Example 11 | US11040034, Ex. No. 11
Type:
Small organic molecule
Emp. Form.:
C24H22F2N6
Mol. Mass.:
432.4685
SMILES:
Fc1ccc(cc1)N1CCN(CC1)c1cc(cnn1)-c1nc2ccc(F)cc2n1C1CC1
: