Target
Cytochrome P450 11B2, mitochondrial
Ligand
BDBM287697
Substrate
Meas. Tech.
Metalloenzyme Activity
IC50
<100±n/a nM
Citation
 Sparks, SYates, CMShaver, SRHoekstra, WJ Metalloenzyme inhibitor compounds US Patent  US10085984 Publication Date 10/2/2018 
Target
Name:
Cytochrome P450 11B2, mitochondrial
Synonyms:
Aldosterone Synthase (CYP11B2) Aldosterone-synthesizing enzyme CYP11B2 Cytochrome P450 11B2 Cytochrome P450 11B2, mitochondrial P-450C18 | Steroid 18-hydroxylase
Type:
Protein
Mol. Mass.:
57582.15
Organism:
Homo sapiens (Human)
Description:
P19099
Residue:
503
  
Inhibitor
Name:
BDBM287697
Synonyms:
US10085984, Example 75 | US11040034, Ex. No. 75
Type:
Small organic molecule
Emp. Form.:
C18H15N5
Mol. Mass.:
301.3452
SMILES:
N#Cc1ccc2nc(-c3cnnc(c3)C3CC3)n(C3CC3)c2c1
: