Target
Caspase-7
Ligand
BDBM160849
Substrate
Meas. Tech.
Fluorometric Enzymatic Assay
IC50
500±n/a nM
Citation
 Ahlfors, JMekouar, K Selective caspase inhibitors and uses thereof US Patent  US9045524 Publication Date 6/2/2015 
Target
Name:
Caspase-7
Synonyms:
Apoptotic protease Mch-3 CASP7 CMH-1 MCH3 | caspase 7, apoptosis-related cysteine peptidase
Type:
Enzyme
Mol. Mass.:
34273.91
Organism:
Homo sapiens (Human)
Description:
P55210
Residue:
303
  
Inhibitor
Name:
BDBM160849
Synonyms:
US9045524, 123
Type:
Small organic molecule
Emp. Form.:
C31H37ClN4O11S
Mol. Mass.:
709.164
SMILES:
CC(C)[C@H](NC(=O)[C@@H](NC(=O)[C@H](CC(O)=O)NC(=O)OCc1ccccc1)c1ccccc1)C(=O)N[C@@H](CC(O)=O)\C=C(/Cl)S(C)(=O)=O
: